threaten-v
type: LexicalEntry
canonical form: threaten
sense: 00873067-v
part of speech: verb

00873067-v
type: LexicalConcept
in scheme: en-word.net
definition: to utter intentions of injury or punishment against
example: He threatened me when I tried to call the police
ili: i25981
lexfile: verb.communication
part of speech: verb
hypernym: 00871877-v