combination-n
type: LexicalEntry
canonical form: combination
sense: 00872131-n
part of speech: noun

00872131-n
type: LexicalConcept
in scheme: en-word.net
definition: the act of arranging elements into specified groups without regard to order
ili: i39969
lexfile: noun.act
part of speech: noun
hypernym: 00871261-n