transposition-n
type: LexicalEntry
canonical form: transposition
sense: 00870938-n
part of speech: noun

00870938-n
type: LexicalConcept
in scheme: en-word.net
definition: (mathematics) the transfer of a quantity from one side of an equation to the other along with a change of sign
ili: i39964
lexfile: noun.act
part of speech: noun
domain topic: 06022075-n
hypernym: 00870588-n