bless-v
type: LexicalEntry
canonical form: bless
sense: 00868895-v
part of speech: verb

sign-v
type: LexicalEntry
canonical form: sign
sense: 00868895-v
part of speech: verb

00868895-v
type: LexicalConcept
in scheme: en-word.net
definition: make the sign of the cross over someone in order to call on God for protection; consecrate
ili: i25963
lexfile: verb.communication
part of speech: verb
hypernym: 00994073-v