applaud-v
type: LexicalEntry
canonical form: applaud
sense: 00861956-v
part of speech: verb

00861956-v
type: LexicalConcept
in scheme: en-word.net
definition: express that something is worthy of praise
example: I applaud your efforts
ili: i25930
lexfile: verb.communication
part of speech: verb
hypernym: 00858506-v