reaction-n
type: LexicalEntry
canonical form: reaction
sense: 00860679-n
part of speech: noun

response-n
type: LexicalEntry
canonical form: response
sense: 00860679-n
part of speech: noun

00860679-n
type: LexicalConcept
in scheme: en-word.net
definition: a bodily process occurring due to the effect of some antecedent stimulus or agent
example: a bad reaction to the medicine
example: his responses have slowed with age
ili: i39914
lexfile: noun.act
part of speech: noun
hypernym: 13461236-n