businesslike-a
type: LexicalEntry
canonical form: businesslike
sense: 00843498-s
part of speech: adjective

00843498-s
type: LexicalConcept
in scheme: en-word.net
definition: exhibiting methodical and systematic characteristics that would be useful in business
ili: i4608
lexfile: adj.all
part of speech: adjective satellite
similar: https://en-word.net/synset/00843158-a