gulp-n
type: LexicalEntry
canonical form: gulp
sense: 00842024-n
part of speech: noun

gulping-n
type: LexicalEntry
canonical form: gulping
sense: 00842024-n
part of speech: noun

00842024-n
type: LexicalConcept
in scheme: en-word.net
definition: a spasmodic reflex of the throat made as if in swallowing
ili: i39815
lexfile: noun.act
part of speech: noun
hypernym: 00865191-n