blow-n
type: LexicalEntry
canonical form: blow
sense: 00837162-n
part of speech: noun

puff-n
type: LexicalEntry
canonical form: puff
sense: 00837162-n
part of speech: noun

00837162-n
type: LexicalConcept
in scheme: en-word.net
definition: forceful exhalation through the nose or mouth
example: he gave his nose a loud blow
example: he blew out all the candles with a single puff
ili: i39793
lexfile: noun.act
part of speech: noun
hypernym: 00836928-n