breath-n
type: LexicalEntry
canonical form: breath
sense: 00836693-n
part of speech: noun

00836693-n
type: LexicalConcept
in scheme: en-word.net
definition: the process of taking in and expelling air during breathing
example: he took a deep breath and dived into the pool
example: he was fighting to his last breath
ili: i39791
lexfile: noun.act
part of speech: noun
hypernym: 13461236-n