suborn-v
type: LexicalEntry
canonical form: suborn
sense: 00836622-v
part of speech: verb

00836622-v
type: LexicalConcept
in scheme: en-word.net
definition: induce to commit perjury or give false testimony
example: The President tried to suborn false witnesses
ili: i25824
lexfile: verb.communication
part of speech: verb
causes: 00836424-v
hypernym: 00772482-v
similar: 00836837-v