investment-n
type: LexicalEntry
canonical form: investment
sense: 00830123-n
part of speech: noun

00830123-n
type: LexicalConcept
in scheme: en-word.net
definition: the act of putting on robes or vestments
ili: i39759
lexfile: noun.act
part of speech: noun
hypernym: 00829898-n