dressing-n
type: LexicalEntry
canonical form: dressing
sense: 00829898-n
part of speech: noun

grooming-n
type: LexicalEntry
canonical form: grooming
sense: 00829898-n
part of speech: noun

00829898-n
type: LexicalConcept
in scheme: en-word.net
definition: the activity of getting dressed; putting on clothes
ili: i39758
lexfile: noun.act
part of speech: noun
hypernym: 00829743-n