profess-v
type: LexicalEntry
canonical form: profess
sense: 00821417-v
part of speech: verb

00821417-v
type: LexicalConcept
in scheme: en-word.net
definition: practice as a profession, teach, or claim to be knowledgeable about
example: She professes organic chemistry
ili: i25759
lexfile: verb.communication
part of speech: verb
hypernym: 00758383-v