preservation-n
type: LexicalEntry
canonical form: preservation
sense: 00820685-n
part of speech: noun

saving-n
type: LexicalEntry
canonical form: saving
sense: 00820685-n
part of speech: noun

00820685-n
type: LexicalConcept
in scheme: en-word.net
definition: the activity of protecting something from loss or danger
ili: i39707
lexfile: noun.act
part of speech: noun
hypernym: 00819341-n