premature-a
type: LexicalEntry
canonical form: premature
sense: 00818569-s
part of speech: adjective

untimely-a
type: LexicalEntry
canonical form: untimely
sense: 00818569-s
part of speech: adjective

00818569-s
type: LexicalConcept
in scheme: en-word.net
definition: uncommonly early or before the expected time
example: illness led to his premature death
example: alcohol brought him to an untimely end
ili: i4487
lexfile: adj.all
part of speech: adjective satellite
similar: https://en-word.net/synset/00816521-a