vex-v
type: LexicalEntry
canonical form: vex
sense: 00814544-v
part of speech: verb

00814544-v
type: LexicalConcept
in scheme: en-word.net
definition: subject to prolonged examination, discussion, or deliberation
example: vex the subject of the death penalty
ili: i25728
lexfile: verb.communication
part of speech: verb
hypernym: 00814242-v