storage-n
type: LexicalEntry
canonical form: storage
sense: 00813322-n
part of speech: noun

00813322-n
type: LexicalConcept
in scheme: en-word.net
definition: the commercial enterprise of storing goods and materials
ili: i39671
lexfile: noun.act
part of speech: noun
hypernym: 01096649-n