quibble-v
type: LexicalEntry
canonical form: quibble
sense: 00812047-v
part of speech: verb

00812047-v
type: LexicalConcept
in scheme: en-word.net
definition: evade the truth of a point or question by raising irrelevant objections
ili: i25716
lexfile: verb.communication
part of speech: verb
hypernym: 00811316-v