limitation-n
type: LexicalEntry
canonical form: limitation
sense: 00809843-n
part of speech: noun

restriction-n
type: LexicalEntry
canonical form: restriction
sense: 00809843-n
part of speech: noun

00809843-n
type: LexicalConcept
in scheme: en-word.net
definition: an act of limiting or restricting (as by regulation)
ili: i39650
lexfile: noun.act
part of speech: noun
hypernym: 00806695-n