raise-n
type: LexicalEntry
canonical form: raise
sense: 00804869-n
part of speech: noun

00804869-n
type: LexicalConcept
in scheme: en-word.net
definition: increasing the size of a bet (as in poker)
example: I'll see your raise and double it
ili: i39626
lexfile: noun.act
part of speech: noun
domain topic: 00495779-n
hypernym: 00804623-n