sharp-a
type: LexicalEntry
canonical form: sharp
sense: https://en-word.net/lemma/sharp-a#00804397-a
part of speech: adjective

https://en-word.net/synset/00804397-a
type: LexicalConcept
in scheme: en-word.net
definition: having or made by a thin edge or sharp point; suitable for cutting or piercing
example: a sharp knife
example: a pencil with a sharp point
ili: i4410
lexfile: adj.all
part of speech: adjective
also: https://en-word.net/synset/01814940-a
attribute: 04712672-n
similar: 00804899-s
similar: 00805033-s
similar: 00805110-s
similar: 00805187-s
similar: 00805262-s
similar: 00805445-s
similar: 00805518-s
similar: 00805591-s
similar: 00805750-s
similar: 00805871-s
similar: 00805968-s
similar: 00806085-s
similar: 00806338-s
similar: 00806415-s
similar: 00806531-s