ban-v
type: LexicalEntry
canonical form: ban
sense: 00798054-v
part of speech: verb

00798054-v
type: LexicalConcept
in scheme: en-word.net
definition: prohibit especially by legal means or social pressure
example: Smoking is banned in this building
ili: i25659
lexfile: verb.communication
part of speech: verb
hypernym: 00797525-v