seduce-v
type: LexicalEntry
canonical form: seduce
sense: 00785293-v
part of speech: verb

00785293-v
type: LexicalConcept
in scheme: en-word.net
definition: lure or entice away from duty, principles, or proper conduct
example: She was seduced by the temptation of easy money and started to work in a massage parlor
ili: i25600
lexfile: verb.communication
part of speech: verb
hypernym: 00784574-v
similar: 01431211-v