fraud-n
type: LexicalEntry
canonical form: fraud
sense: 00770581-n
part of speech: noun

00770581-n
type: LexicalConcept
in scheme: en-word.net
definition: intentional deception resulting in injury to another person
ili: i39452
lexfile: noun.act
part of speech: noun
hypernym: 00767761-n