push-v
type: LexicalEntry
canonical form: push
sense: 00768022-v
part of speech: verb

bear on-v
type: LexicalEntry
canonical form: bear on
sense: 00768022-v
part of speech: verb

00768022-v
type: LexicalConcept
in scheme: en-word.net
definition: press, drive, or impel (someone) to action or completion of an action
example: He pushed her to finish her doctorate
ili: i25523
lexfile: verb.communication
part of speech: verb
hypernym: 00767694-v
similar: 02412046-v