offense-n
type: LexicalEntry
canonical form: offense
sense: 00767587-n
part of speech: noun

offence-n
type: LexicalEntry
canonical form: offence
sense: 00767587-n
part of speech: noun

00767587-n
type: LexicalConcept
in scheme: en-word.net
definition: a transgression that constitutes a violation of what is judged to be right
lexfile: noun.act
part of speech: noun
hypernym: 00746303-n