palaver-v
type: LexicalEntry
canonical form: palaver
sense: 00765305-v
part of speech: verb

00765305-v
type: LexicalConcept
in scheme: en-word.net
definition: have a lengthy discussion, usually between people of different backgrounds
ili: i25511
lexfile: verb.communication
part of speech: verb
hypernym: 00765054-v