negociate-v
type: LexicalEntry
canonical form: negociate
sense: 00764523-v
part of speech: verb

00764523-v
type: LexicalConcept
in scheme: en-word.net
definition: confer with another in order to come to terms or reach an agreement
example: The parties negociated all night
ili: i25506
lexfile: verb.communication
part of speech: verb
hypernym: 00815640-v