commune-v
type: LexicalEntry
canonical form: commune
sense: 00762232-v
part of speech: verb

00762232-v
type: LexicalConcept
in scheme: en-word.net
definition: communicate intimately with; be in a state of heightened, intimate receptivity
example: He seemed to commune with nature
ili: i25496
lexfile: verb.communication
part of speech: verb
hypernym: 00742582-v