appeal-v
type: LexicalEntry
canonical form: appeal
sense: 00757492-v
part of speech: verb

invoke-v
type: LexicalEntry
canonical form: invoke
sense: 00757492-v
part of speech: verb

00757492-v
type: LexicalConcept
in scheme: en-word.net
definition: request earnestly (something from somebody); ask for aid or protection
example: appeal to somebody for help
example: Invoke God in times of trouble
ili: i25474
lexfile: verb.communication
part of speech: verb
hypernym: 00754770-v