appearance-n
type: LexicalEntry
canonical form: appearance
sense: 00756620-n
part of speech: noun

show-n
type: LexicalEntry
canonical form: show
sense: 00756620-n
part of speech: noun

00756620-n
type: LexicalConcept
in scheme: en-word.net
definition: pretending that something is the case in order to make a good impression
example: they try to keep up appearances
example: that ceremony is just for show
ili: i39403
lexfile: noun.act
part of speech: noun
hypernym: 00756299-n