ask-v
type: LexicalEntry
canonical form: ask
sense: 00754499-v
part of speech: verb

00754499-v
type: LexicalConcept
in scheme: en-word.net
definition: make a request or demand for something to somebody
example: She asked him for a loan
ili: i25462
lexfile: verb.communication
part of speech: verb
hypernym: 00754770-v