charge-v
type: LexicalEntry
canonical form: charge
sense: 00752351-v
part of speech: verb

00752351-v
type: LexicalConcept
in scheme: en-word.net
definition: instruct (a jury) about the law, its application, and the weighing of evidence
ili: i25450
lexfile: verb.communication
part of speech: verb
domain topic: 08458195-n
hypernym: 00751969-v