trick-n
type: LexicalEntry
canonical form: trick
sense: 00752073-n
part of speech: noun

00752073-n
type: LexicalConcept
in scheme: en-word.net
definition: an attempt to get you to do something foolish or imprudent
example: that offer was a dirty trick
ili: i39381
lexfile: noun.act
part of speech: noun
hypernym: 00750872-n