ping-v
type: LexicalEntry
canonical form: ping
sense: 00745897-v
part of speech: verb

00745897-v
type: LexicalConcept
in scheme: en-word.net
definition: contact, usually in order to remind of something
example: I'll ping my accountant — April 15 is nearing
ili: i25415
lexfile: verb.communication
part of speech: verb
hypernym: 00745330-v