injury-n
type: LexicalEntry
canonical form: injury
sense: 00745603-n
part of speech: noun

00745603-n
type: LexicalConcept
in scheme: en-word.net
definition: wrongdoing that violates another's rights and is unjustly inflicted
ili: i39346
lexfile: noun.act
part of speech: noun
hypernym: 00734044-n