mission-n
type: LexicalEntry
canonical form: mission
sense: 00732282-n
part of speech: noun

missionary work-n
type: LexicalEntry
canonical form: missionary work
sense: 00732282-n
part of speech: noun

00732282-n
type: LexicalConcept
in scheme: en-word.net
definition: the organized work of a religious missionary
ili: i39273
lexfile: noun.act
part of speech: noun
hypernym: 00576778-n