assignment-n
type: LexicalEntry
canonical form: assignment
sense: 00731545-n
part of speech: noun

duty assignment-n
type: LexicalEntry
canonical form: duty assignment
sense: 00731545-n
part of speech: noun

00731545-n
type: LexicalConcept
in scheme: en-word.net
definition: a duty that you are assigned to perform (especially in the armed forces)
example: hazardous assignment
ili: i39270
lexfile: noun.act
part of speech: noun
hypernym: 00720746-n