prep-n
type: LexicalEntry
canonical form: prep
sense: 00730406-n
part of speech: noun

preparation-n
type: LexicalEntry
canonical form: preparation
sense: 00730406-n
part of speech: noun

00730406-n
type: LexicalConcept
in scheme: en-word.net
definition: preparatory school work done outside school (especially at home)
ili: i39262
lexfile: noun.act
part of speech: noun
hypernym: 00729939-n