look to-v
type: LexicalEntry
canonical form: look to
sense: 00722541-v
part of speech: verb

00722541-v
type: LexicalConcept
in scheme: en-word.net
definition: turn one's interests or expectations towards
example: look to the future
example: this method looks to significant wavings
ili: i25303
lexfile: verb.cognition
part of speech: verb
hypernym: 00721987-v