react-v
type: LexicalEntry
canonical form: react
sense: 00719282-v
part of speech: verb

respond-v
type: LexicalEntry
canonical form: respond
sense: 00719282-v
part of speech: verb

00719282-v
type: LexicalConcept
in scheme: en-word.net
definition: show a response or a reaction to something
ili: i25289
lexfile: verb.cognition
part of speech: verb
hypernym: 02372362-v