correlate-v
type: LexicalEntry
canonical form: correlate
sense: 00715901-v
part of speech: verb

00715901-v
type: LexicalConcept
in scheme: en-word.net
definition: bring into a mutual, complementary, or reciprocal relation
example: I cannot correlate these two pieces of information
ili: i25273
lexfile: verb.cognition
part of speech: verb
hypernym: 00715072-v
similar: 02665057-v