acupuncture-n
type: LexicalEntry
canonical form: acupuncture
sense: 00711408-n
part of speech: noun

stylostixis-n
type: LexicalEntry
canonical form: stylostixis
sense: 00711408-n
part of speech: noun

00711408-n
type: LexicalConcept
in scheme: en-word.net
definition: treatment of pain or disease by inserting the tips of needles at specific points on the skin
ili: i39163
lexfile: noun.act
part of speech: noun
domain region: 08740839-n
hypernym: 00659325-n