administration-n
type: LexicalEntry
canonical form: administration
sense: 00696119-n
part of speech: noun

judicature-n
type: LexicalEntry
canonical form: judicature
sense: 00696119-n
part of speech: noun

00696119-n
type: LexicalConcept
in scheme: en-word.net
definition: the act of meting out justice according to the law
ili: i39087
lexfile: noun.act
part of speech: noun
hypernym: 00695934-n