feel-v
type: LexicalEntry
canonical form: feel
sense: 00692071-v
part of speech: verb

00692071-v
type: LexicalConcept
in scheme: en-word.net
definition: have a feeling or perception about oneself in reaction to someone's behavior or attitude
example: She felt small and insignificant
example: You make me feel naked
example: I made the students feel different about themselves
ili: i25164
lexfile: verb.cognition
part of speech: verb
hypernym: 00691086-v