assess-v
type: LexicalEntry
canonical form: assess
sense: 00684149-v
part of speech: verb

00684149-v
type: LexicalConcept
in scheme: en-word.net
definition: estimate the value of (property) for taxation
example: Our house hasn't been assessed in years
ili: i25126
lexfile: verb.cognition
part of speech: verb
hypernym: 00674352-v
similar: 00683348-v