dispose-v
type: LexicalEntry
canonical form: dispose
sense: 00682760-v
part of speech: verb

incline-v
type: LexicalEntry
canonical form: incline
sense: 00682760-v
part of speech: verb

00682760-v
type: LexicalConcept
in scheme: en-word.net
definition: make receptive or willing towards an action or attitude or belief
example: Their language inclines us to believe them
ili: i25122
lexfile: verb.cognition
part of speech: verb
hypernym: 00702806-v