therapy-n
type: LexicalEntry
canonical form: therapy
sense: 00662334-n
part of speech: noun

treatment-n
type: LexicalEntry
canonical form: treatment
sense: 00662334-n
part of speech: noun

00662334-n
type: LexicalConcept
in scheme: en-word.net
definition: (medicine) the act of caring for someone (as by medication or remedial training etc.)
example: the quarterback is undergoing treatment for a knee injury
example: he tried every treatment the doctors suggested
example: heat therapy gave the best relief
ili: i38900
lexfile: noun.act
part of speech: noun
domain topic: 06052606-n
hypernym: 00658847-n