treatment-n
type: LexicalEntry
canonical form: treatment
sense: 00659325-n
part of speech: noun

intervention-n
type: LexicalEntry
canonical form: intervention
sense: 00659325-n
part of speech: noun

00659325-n
type: LexicalConcept
in scheme: en-word.net
definition: care provided to improve a situation (especially medical procedures or applications that are intended to relieve illness or injury)
ili: i38886
lexfile: noun.act
part of speech: noun
hypernym: 00656128-n
mero part: 04081594-n